[Bro] error when generating documentation

Michal Purzynski michal at rsbac.org
Wed Sep 25 14:22:45 PDT 2013

Hello, that's on the 2.2-beta on OS X

make doc results in the following error

Failed to document '@load base/protocols/ssl' in file: 
error in 
line 5: can't open 
make[4]: *** [doc/rest_output/test-all-policy.rst] Error 1
make[3]: *** [doc/scripts/CMakeFiles/restdoc.dir/all] Error 2
make[2]: *** [doc/CMakeFiles/doc.dir/rule] Error 2
make[1]: *** [doc] Error 2
make: *** [doc] Error 2

More information about the Bro mailing list