[Bro] Gentoo Package - Include Failure of CAF

M.B. tomboy64 at sina.cn
Fri Mar 11 06:12:40 PST 2016


Good afternoon,

for Bro-2.4.1 I am currently creating a package for the Gentoo
Distribution. Gentoo is a distro which compiles packages natively on the
user's computer; for that our package manager hooks into the build system.

I've created a package for the actor-framework and the its libs can be
found in /usr/lib/libcaf_{io,core}.so.0.14.4; its headers can be found
in /usr/include/caf.

Attached you can find a build.log and from there you can see that during
the configure phase, Libcaf is properly found. You can also see which
options cmake is run with.
However, while compiling broker, the file
caf/detail/abstract_uniform_type_info.hpp cannot be found. Is there some
magic involved regarding the passing on of include files to the actual
compile of broker?

Disabling broker, the whole compile works smoothly.

Best regards,
tomboy64
-------------- next part --------------
 * Package:    net-analyzer/bro-2.4.1
 * Repository: gentoo
 * Maintainer: tomboy64 at sina.cn proxy-maint at gentoo.org
 * USE:        abi_x86_64 amd64 broccoli broctl broker curl elibc_glibc geoip ipv6 kernel_linux python python_single_target_python3_4 python_targets_python2_7 python_targets_python3_4 python_targets_python3_5 tools userland_GNU
 * FEATURES:   preserve-libs sandbox userpriv usersandbox
 * Package:    net-analyzer/bro-2.4.1
 * Repository: gentoo
 * Maintainer: tomboy64 at sina.cn proxy-maint at gentoo.org
 * USE:        abi_x86_64 amd64 broccoli broctl broker curl elibc_glibc geoip ipv6 kernel_linux python python_single_target_python3_4 python_targets_python2_7 python_targets_python3_4 python_targets_python3_5 tools userland_GNU
 * FEATURES:   preserve-libs sandbox userpriv usersandbox
>>> Unpacking source...
>>> Unpacking bro-2.4.1.tar.gz to /tmp/portage/net-analyzer/bro-2.4.1/work
>>> Source unpacked in /tmp/portage/net-analyzer/bro-2.4.1/work
>>> Preparing source in /tmp/portage/net-analyzer/bro-2.4.1/work/bro-2.4.1 ...
>>> Source prepared.
>>> Configuring source in /tmp/portage/net-analyzer/bro-2.4.1/work/bro-2.4.1 ...
>>> Working in BUILD_DIR: "/tmp/portage/net-analyzer/bro-2.4.1/work/bro-2.4.1_build"
cmake --no-warn-unused-cli -C /tmp/portage/net-analyzer/bro-2.4.1/work/bro-2.4.1_build/gentoo_common_config.cmake -G Unix Makefiles -DCMAKE_INSTALL_PREFIX=/usr -DENABLE_DEBUG=false -DENABLE_JEMALLOC=false -DENABLE_PERFTOOLS=false -DENABLE_BROKER=true -DENABLE_CXX11=true -DBROKER_PYTHON_PREFIX=/usr -DLIBCAF_INCLUDE_DIR_CORE=/usr/include/ -DLIBCAF_INCLUDE_DIR_IO=/usr/include/ -DLIBCAF_ROOT_DIR=/usr -DENABLE_STATIC=false -DINSTALL_BROCCOLI=true -DINSTALL_BROCTL=true -DINSTALL_AUX_TOOLS=true -DENABLE_MOBILE_IPV6=true -DDISABLE_RUBY_BINDINGS=true -DDISABLE_PYTHON_BINDINGS=false -DBRO_LOG_DIR=/var/log/bro/ -DBRO_SPOOL_DIR=/var/spool/bro/ -DBRO_ETC_INSTALL_DIR=/etc/bro/ -DCMAKE_BUILD_TYPE=Gentoo -DCMAKE_INSTALL_DO_STRIP=OFF -DCMAKE_USER_MAKE_RULES_OVERRIDE=/tmp/portage/net-analyzer/bro-2.4.1/work/bro-2.4.1_build/gentoo_rules.cmake -DCMAKE_TOOLCHAIN_FILE=/tmp/portage/net-analyzer/bro-2.4.1/work/bro-2.4.1_build/gentoo_toolchain.cmake  /tmp/portage/net-analyzer/bro-2.4.1/work/bro-2.4.1
Not searching for unused variables given on the command line.
loading initial cache file /tmp/portage/net-analyzer/bro-2.4.1/work/bro-2.4.1_build/gentoo_common_config.cmake
-- The C compiler identification is GNU 5.3.0
-- The CXX compiler identification is GNU 5.3.0
-- Check for working C compiler: /usr/bin/x86_64-pc-linux-gnu-gcc
-- Check for working C compiler: /usr/bin/x86_64-pc-linux-gnu-gcc -- works
-- Detecting C compiler ABI info
-- Detecting C compiler ABI info - done
-- Detecting C compile features
-- Detecting C compile features - done
-- Check for working CXX compiler: /usr/bin/x86_64-pc-linux-gnu-g++
-- Check for working CXX compiler: /usr/bin/x86_64-pc-linux-gnu-g++ -- works
-- Detecting CXX compiler ABI info
-- Detecting CXX compiler ABI info - done
-- Detecting CXX compile features
-- Detecting CXX compile features - done
-- Found sed: /bin/sed
-- Found Perl: /usr/bin/perl (found version "5.22.1") 
-- Found FLEX: 2.6.0  
-- Found BISON: /usr/bin/bison  
-- Found PCAP: /usr/lib64/libpcap.so  
-- Performing Test PCAP_LINKS_SOLO
-- Performing Test PCAP_LINKS_SOLO - Success
-- Looking for pcap_get_pfring_id
-- Looking for pcap_get_pfring_id - not found
-- Found OpenSSL: /usr/lib64/libssl.so;/usr/lib64/libcrypto.so  
-- Performing Test ns_initparse_works_none
-- Performing Test ns_initparse_works_none - Failed
-- Performing Test res_mkquery_works_none
-- Performing Test res_mkquery_works_none - Success
-- Performing Test ns_initparse_works_libresolv.a
-- Performing Test ns_initparse_works_libresolv.a - Success
-- Performing Test res_mkquery_works_libresolv.a
-- Performing Test res_mkquery_works_libresolv.a - Success
-- Found BIND: /usr/lib64/libresolv.a  
-- Found ZLIB: /usr/lib64/libz.so (found version "1.2.8") 
-- Check if the system is big endian
-- Searching 16 bit integer
-- Looking for sys/types.h
-- Looking for sys/types.h - found
-- Looking for stdint.h
-- Looking for stdint.h - found
-- Looking for stddef.h
-- Looking for stddef.h - found
-- Check size of unsigned short
-- Check size of unsigned short - done
-- Using unsigned short
-- Check if the system is big endian - little endian
-- Check size of unsigned int
-- Check size of unsigned int - done

==================|  BinPAC Build Summary  |====================

Install prefix:    /usr
Debug mode:        false

CC:                /usr/bin/x86_64-pc-linux-gnu-gcc
CFLAGS:            -march=broadwell -O2 -pipe -mabm  -Wall -Wno-unused 
CXX:               /usr/bin/x86_64-pc-linux-gnu-g++
CXXFLAGS:          -march=broadwell -O2 -pipe -mabm  -Wall -Wno-unused 
CPP:               /usr/bin/x86_64-pc-linux-gnu-g++

================================================================

-- Found BinPAC: binpac  
-- Found LibGeoIP: /usr/lib64/libGeoIP.so  
-- Performing Test HAVE_GEOIP_COUNTRY_EDITION_V6
-- Performing Test HAVE_GEOIP_COUNTRY_EDITION_V6 - Success
-- Performing Test HAVE_GEOIP_CITY_EDITION_REV0_V6
-- Performing Test HAVE_GEOIP_CITY_EDITION_REV0_V6 - Success
-- Found GooglePerftools: /usr/lib64/libtcmalloc.so  
-- Found tcmalloc: /usr/lib64/libtcmalloc.so  
-- Check if the system is big endian
-- Searching 16 bit integer
-- Using unsigned short
-- Check if the system is big endian - little endian
-- Looking for htonll
-- Looking for htonll - not found
-- Check size of long int
-- Check size of long int - done
-- Check size of long long
-- Check size of long long - done
-- Check size of void *
-- Check size of void * - done
-- Check size of int32_t
-- Check size of int32_t - done
-- Check size of u_int32_t
-- Check size of u_int32_t - done
-- Check size of u_int16_t
-- Check size of u_int16_t - done
-- Check size of u_int8_t
-- Check size of u_int8_t - done
-- Check size of socklen_t
-- Check size of socklen_t - done
-- Check size of struct ip6_opt
-- Check size of struct ip6_opt - done
-- Check size of struct ip6_ext
-- Check size of struct ip6_ext - done
-- Looking for include file getopt.h
-- Looking for include file getopt.h - found
-- Looking for include file memory.h
-- Looking for include file memory.h - found
-- Looking for 4 include files sys/socket.h, ..., netinet/if_ether.h
-- Looking for 4 include files sys/socket.h, ..., netinet/if_ether.h - found
-- Looking for 4 include files sys/socket.h, ..., netinet/ip6.h
-- Looking for 4 include files sys/socket.h, ..., netinet/ip6.h - found
-- Looking for 3 include files sys/socket.h, ..., net/ethernet.h
-- Looking for 3 include files sys/socket.h, ..., net/ethernet.h - found
-- Looking for include file sys/ethernet.h
-- Looking for include file sys/ethernet.h - not found
-- Looking for include file net/ethertypes.h
-- Looking for include file net/ethertypes.h - not found
-- Looking for include file sys/time.h
-- Looking for include file sys/time.h - found
-- Looking for include files time.h, sys/time.h
-- Looking for include files time.h, sys/time.h - found
-- Looking for include file os-proto.h
-- Looking for include file os-proto.h - not found
-- Performing Test HAVE_READLINE_HISTORY_ENTRIES
-- Performing Test HAVE_READLINE_HISTORY_ENTRIES - Failed
-- Looking for include files stdio.h, readline/readline.h
-- Looking for include files stdio.h, readline/readline.h - found
-- Looking for include files stdio.h, readline/history.h
-- Looking for include files stdio.h, readline/history.h - found
-- Performing Test SIN_LEN
-- Performing Test SIN_LEN - Failed
-- Looking for IPPROTO_HOPOPTS
-- Looking for IPPROTO_HOPOPTS - found
-- Looking for IPPROTO_IPV6
-- Looking for IPPROTO_IPV6 - found
-- Looking for IPPROTO_IPV4
-- Looking for IPPROTO_IPV4 - not found
-- Looking for IPPROTO_ROUTING
-- Looking for IPPROTO_ROUTING - found
-- Looking for IPPROTO_FRAGMENT
-- Looking for IPPROTO_FRAGMENT - found
-- Looking for IPPROTO_ESP
-- Looking for IPPROTO_ESP - found
-- Looking for IPPROTO_AH
-- Looking for IPPROTO_AH - found
-- Looking for IPPROTO_ICMPV6
-- Looking for IPPROTO_ICMPV6 - found
-- Looking for IPPROTO_NONE
-- Looking for IPPROTO_NONE - found
-- Looking for IPPROTO_DSTOPTS
-- Looking for IPPROTO_DSTOPTS - found
-- Looking for getopt_long
-- Looking for getopt_long - found
-- Looking for mallinfo
-- Looking for mallinfo - found
-- Looking for strcasestr
-- Looking for strcasestr - found
-- Looking for strerror
-- Looking for strerror - found
-- Looking for strsep
-- Looking for strsep - found
-- Looking for sigset
-- Looking for sigset - found
-- Performing Test DO_SOCK_DECL
-- Performing Test DO_SOCK_DECL - Failed
-- Performing Test SYSLOG_INT
-- Performing Test SYSLOG_INT - Failed
-- Looking for include file pcap-int.h
-- Looking for include file pcap-int.h - not found
-- Looking for pcap_freecode
-- Looking for pcap_freecode - found
-- Performing Test LIBPCAP_PCAP_COMPILE_NOPCAP_HAS_ERROR_PARAMETER
-- Performing Test LIBPCAP_PCAP_COMPILE_NOPCAP_HAS_ERROR_PARAMETER - Failed
-- Performing Test LIBPCAP_PCAP_COMPILE_NOPCAP_NO_ERROR_PARAMETER
-- Performing Test LIBPCAP_PCAP_COMPILE_NOPCAP_NO_ERROR_PARAMETER - Success
-- Looking for DLT_PPP_SERIAL
-- Looking for DLT_PPP_SERIAL - found
-- Performing Test including_ssl_h_works
-- Performing Test including_ssl_h_works - Success
-- Performing Test openssl_greater_than_0_9_7
-- Performing Test openssl_greater_than_0_9_7 - Success
-- Performing Test OPENSSL_D2I_X509_USES_CONST_CHAR
-- Performing Test OPENSSL_D2I_X509_USES_CONST_CHAR - Success
-- Performing Test have_nameser_header
-- Performing Test have_nameser_header - Success
-- Found Libcaf: /usr/lib64/libcaf_core.so;/usr/lib64/libcaf_io.so  
-- Found CAF version: 0.14.4
-- Could NOT find RocksDB (missing:  ROCKSDB_LIBRARIES ROCKSDB_INCLUDE_DIRS) 
-- Check if the system is big endian
-- Searching 16 bit integer
-- Using unsigned short
-- Check if the system is big endian - little endian
-- Found SWIG: /usr/bin/swig (found version "3.0.8") 
-- Found PythonInterp: /tmp/portage/net-analyzer/bro-2.4.1/temp/python3.4/bin/python (found version "3.4.3") 
-- Found PythonDev: /tmp/portage/net-analyzer/bro-2.4.1/temp/python3.4/bin/python-config  
-- Python bindings will be built and installed to: /usr/lib/python3.4/site-packages

==================|  broker Config Summary  |====================
Version:         0.4.0
SO version:      0
Build Type:      Gentoo
Install prefix:  /usr
Library prefix:  /usr/lib
Shared libs:     true
Static libs:     false
Enable RocksDB:  FALSE
Python bindings: true

CC:              /usr/bin/x86_64-pc-linux-gnu-gcc
CFLAGS:          -march=broadwell -O2 -pipe -mabm  -Wall -Wno-unused 
CXX:             /usr/bin/x86_64-pc-linux-gnu-g++
CXXFLAGS:        -march=broadwell -O2 -pipe -mabm  -Wall -Wno-unused -std=c++11 
=================================================================
-- Looking for pthread.h
-- Looking for pthread.h - found
-- Looking for pthread_create
-- Looking for pthread_create - not found
-- Looking for pthread_create in pthreads
-- Looking for pthread_create in pthreads - not found
-- Looking for pthread_create in pthread
-- Looking for pthread_create in pthread - found
-- Found Threads: TRUE  

===============|  PySubnetTree Build Summary  |=================

Install dir:       lib/python
Debug mode:        false

CC:                /usr/bin/x86_64-pc-linux-gnu-gcc
CFLAGS:            -march=broadwell -O2 -pipe -mabm  -Wall -Wno-unused 
CXX:               /usr/bin/x86_64-pc-linux-gnu-g++
CXXFLAGS:          -march=broadwell -O2 -pipe -mabm  -Wall -Wno-unused -std=c++11 
CPP:               /usr/bin/x86_64-pc-linux-gnu-g++

================================================================


=================|  capstats Build Summary  |===================

Install prefix:    /usr
Debug mode:        false

CXX:               /usr/bin/x86_64-pc-linux-gnu-g++
CXXFLAGS:          -march=broadwell -O2 -pipe -mabm  -Wall -Wno-unused -std=c++11 
CPP:               /usr/bin/x86_64-pc-linux-gnu-g++

================================================================

CMake Warning at aux/broctl/aux/trace-summary/CMakeLists.txt:30 (message):
  Could not find dependency: 'ipsumdump', trace-summary will not be able to
  read pcap traces



=============|  trace-summary Install Summary  |================

Install destination:    /usr/bin

================================================================

-- Found SubnetTree: build from source aux/pysubnettree  

=================|  Broctl Install Summary  |===================

Install prefix:    /usr
Bro root:          /usr
Scripts Dir:       /usr/share/bro
Spool Dir:         /var/spool/bro/
Log Dir:           /var/log/bro/
Config File Dir:   /etc/bro/

================================================================


==================|  Bro-Aux Build Summary  |===================

Install prefix:    /usr
Debug mode:        false

CC:                /usr/bin/x86_64-pc-linux-gnu-gcc
CFLAGS:            -march=broadwell -O2 -pipe -mabm  -Wall -Wno-unused 
CXX:               /usr/bin/x86_64-pc-linux-gnu-g++
CXXFLAGS:          -march=broadwell -O2 -pipe -mabm  -Wall -Wno-unused -std=c++11 
CPP:               /usr/bin/x86_64-pc-linux-gnu-g++

================================================================

-- Looking for geteuid
-- Looking for geteuid - found
-- Looking for getpwuid
-- Looking for getpwuid - found
-- Check size of uint
-- Check size of uint - done
-- Found Broccoli: broccoli  

================|  PyBroccoli Build Summary  |==================

Install dir:       lib/python
Debug mode:        false

CC:                /usr/bin/x86_64-pc-linux-gnu-gcc
CFLAGS:            -march=broadwell -O2 -pipe -mabm  -Wall -Wno-unused 
CPP:               /usr/bin/x86_64-pc-linux-gnu-gcc

================================================================

-- Not building broccoli-ruby bindings

=================|  Broccoli Build Summary  |===================

Install prefix:    /usr
Library prefix:    /usr/lib
Debug mode:        false
Shared libs:       true
Static libs:       false

Config file:       /etc/bro//broccoli.conf
Packet support:    true

CC:                /usr/bin/x86_64-pc-linux-gnu-gcc
CFLAGS:            -march=broadwell -O2 -pipe -mabm  -Wall -Wno-unused 
CPP:               /usr/bin/x86_64-pc-linux-gnu-gcc

================================================================


====================|  Bro Build Summary  |=====================

Install prefix:    /usr
Bro Script Path:   /usr/share/bro
Debug mode:        false

CC:                /usr/bin/x86_64-pc-linux-gnu-gcc
CFLAGS:            -march=broadwell -O2 -pipe -mabm  -Wall -Wno-unused 
CXX:               /usr/bin/x86_64-pc-linux-gnu-g++
CXXFLAGS:          -march=broadwell -O2 -pipe -mabm  -Wall -Wno-unused -std=c++11 
CPP:               /usr/bin/x86_64-pc-linux-gnu-g++

Broker:            true
Broccoli:          true
Broctl:            true
Aux. Tools:        true

GeoIP:             true
gperftools found:  true
        tcmalloc:  true
       debugging:  false
jemalloc:          false

================================================================

-- <<< Gentoo configuration >>>
Build type      Gentoo
Install path    /usr
Compiler flags:
C               -march=broadwell -O2 -pipe -mabm  -Wall -Wno-unused
C++             -march=broadwell -O2 -pipe -mabm  -Wall -Wno-unused -std=c++11
Linker flags:
Executable       -Wl,-O1 -Wl,--as-needed
Module           -Wl,-O1 -Wl,--as-needed
Shared           -Wl,-O1 -Wl,--as-needed

-- Configuring done
-- Generating done
-- Build files have been written to: /tmp/portage/net-analyzer/bro-2.4.1/work/bro-2.4.1_build
>>> Source configured.
>>> Compiling source in /tmp/portage/net-analyzer/bro-2.4.1/work/bro-2.4.1 ...
>>> Working in BUILD_DIR: "/tmp/portage/net-analyzer/bro-2.4.1/work/bro-2.4.1_build"
make -j1 VERBOSE=1 
/usr/bin/cmake -H/tmp/portage/net-analyzer/bro-2.4.1/work/bro-2.4.1 -B/tmp/portage/net-analyzer/bro-2.4.1/work/bro-2.4.1_build --check-build-system CMakeFiles/Makefile.cmake 0
/usr/bin/cmake -E cmake_progress_start /tmp/portage/net-analyzer/bro-2.4.1/work/bro-2.4.1_build/CMakeFiles /tmp/portage/net-analyzer/bro-2.4.1/work/bro-2.4.1_build/CMakeFiles/progress.marks
make -f CMakeFiles/Makefile2 all
make[1]: Entering directory '/tmp/portage/net-analyzer/bro-2.4.1/work/bro-2.4.1_build'
make -f aux/binpac/lib/CMakeFiles/binpac_lib.dir/build.make aux/binpac/lib/CMakeFiles/binpac_lib.dir/depend
make[2]: Entering directory '/tmp/portage/net-analyzer/bro-2.4.1/work/bro-2.4.1_build'
cd /tmp/portage/net-analyzer/bro-2.4.1/work/bro-2.4.1_build && /usr/bin/cmake -E cmake_depends "Unix Makefiles" /tmp/portage/net-analyzer/bro-2.4.1/work/bro-2.4.1 /tmp/portage/net-analyzer/bro-2.4.1/work/bro-2.4.1/aux/binpac/lib /tmp/portage/net-analyzer/bro-2.4.1/work/bro-2.4.1_build /tmp/portage/net-analyzer/bro-2.4.1/work/bro-2.4.1_build/aux/binpac/lib /tmp/portage/net-analyzer/bro-2.4.1/work/bro-2.4.1_build/aux/binpac/lib/CMakeFiles/binpac_lib.dir/DependInfo.cmake --color=
Dependee "/tmp/portage/net-analyzer/bro-2.4.1/work/bro-2.4.1_build/aux/binpac/lib/CMakeFiles/binpac_lib.dir/DependInfo.cmake" is newer than depender "/tmp/portage/net-analyzer/bro-2.4.1/work/bro-2.4.1_build/aux/binpac/lib/CMakeFiles/binpac_lib.dir/depend.internal".
Dependee "/tmp/portage/net-analyzer/bro-2.4.1/work/bro-2.4.1_build/aux/binpac/lib/CMakeFiles/CMakeDirectoryInformation.cmake" is newer than depender "/tmp/portage/net-analyzer/bro-2.4.1/work/bro-2.4.1_build/aux/binpac/lib/CMakeFiles/binpac_lib.dir/depend.internal".
Scanning dependencies of target binpac_lib
make[2]: Leaving directory '/tmp/portage/net-analyzer/bro-2.4.1/work/bro-2.4.1_build'
make -f aux/binpac/lib/CMakeFiles/binpac_lib.dir/build.make aux/binpac/lib/CMakeFiles/binpac_lib.dir/build
make[2]: Entering directory '/tmp/portage/net-analyzer/bro-2.4.1/work/bro-2.4.1_build'
[  0%] Building CXX object aux/binpac/lib/CMakeFiles/binpac_lib.dir/binpac_buffer.cc.o
cd /tmp/portage/net-analyzer/bro-2.4.1/work/bro-2.4.1_build/aux/binpac/lib && /usr/bin/x86_64-pc-linux-gnu-g++   -I/tmp/portage/net-analyzer/bro-2.4.1/work/bro-2.4.1_build/aux/binpac -I/tmp/portage/net-analyzer/bro-2.4.1/work/bro-2.4.1/aux/binpac/lib -I/tmp/portage/net-analyzer/bro-2.4.1/work/bro-2.4.1_build/aux/binpac/lib   -DNDEBUG -march=broadwell -O2 -pipe -mabm  -Wall -Wno-unused   -o CMakeFiles/binpac_lib.dir/binpac_buffer.cc.o -c /tmp/portage/net-analyzer/bro-2.4.1/work/bro-2.4.1/aux/binpac/lib/binpac_buffer.cc
[  0%] Building CXX object aux/binpac/lib/CMakeFiles/binpac_lib.dir/binpac_bytestring.cc.o
cd /tmp/portage/net-analyzer/bro-2.4.1/work/bro-2.4.1_build/aux/binpac/lib && /usr/bin/x86_64-pc-linux-gnu-g++   -I/tmp/portage/net-analyzer/bro-2.4.1/work/bro-2.4.1_build/aux/binpac -I/tmp/portage/net-analyzer/bro-2.4.1/work/bro-2.4.1/aux/binpac/lib -I/tmp/portage/net-analyzer/bro-2.4.1/work/bro-2.4.1_build/aux/binpac/lib   -DNDEBUG -march=broadwell -O2 -pipe -mabm  -Wall -Wno-unused   -o CMakeFiles/binpac_lib.dir/binpac_bytestring.cc.o -c /tmp/portage/net-analyzer/bro-2.4.1/work/bro-2.4.1/aux/binpac/lib/binpac_bytestring.cc
[  0%] Building CXX object aux/binpac/lib/CMakeFiles/binpac_lib.dir/binpac_regex.cc.o
cd /tmp/portage/net-analyzer/bro-2.4.1/work/bro-2.4.1_build/aux/binpac/lib && /usr/bin/x86_64-pc-linux-gnu-g++   -I/tmp/portage/net-analyzer/bro-2.4.1/work/bro-2.4.1_build/aux/binpac -I/tmp/portage/net-analyzer/bro-2.4.1/work/bro-2.4.1/aux/binpac/lib -I/tmp/portage/net-analyzer/bro-2.4.1/work/bro-2.4.1_build/aux/binpac/lib   -DNDEBUG -march=broadwell -O2 -pipe -mabm  -Wall -Wno-unused   -o CMakeFiles/binpac_lib.dir/binpac_regex.cc.o -c /tmp/portage/net-analyzer/bro-2.4.1/work/bro-2.4.1/aux/binpac/lib/binpac_regex.cc
[  0%] Linking CXX static library libbinpac.a
cd /tmp/portage/net-analyzer/bro-2.4.1/work/bro-2.4.1_build/aux/binpac/lib && /usr/bin/cmake -P CMakeFiles/binpac_lib.dir/cmake_clean_target.cmake
cd /tmp/portage/net-analyzer/bro-2.4.1/work/bro-2.4.1_build/aux/binpac/lib && /usr/bin/cmake -E cmake_link_script CMakeFiles/binpac_lib.dir/link.txt --verbose=1
/usr/bin/x86_64-pc-linux-gnu-ar qc libbinpac.a  CMakeFiles/binpac_lib.dir/binpac_buffer.cc.o CMakeFiles/binpac_lib.dir/binpac_bytestring.cc.o CMakeFiles/binpac_lib.dir/binpac_regex.cc.o
/usr/bin/x86_64-pc-linux-gnu-ranlib libbinpac.a
make[2]: Leaving directory '/tmp/portage/net-analyzer/bro-2.4.1/work/bro-2.4.1_build'
[  0%] Built target binpac_lib
make -f aux/binpac/src/CMakeFiles/binpac.dir/build.make aux/binpac/src/CMakeFiles/binpac.dir/depend
make[2]: Entering directory '/tmp/portage/net-analyzer/bro-2.4.1/work/bro-2.4.1_build'
[  0%] [FLEX][PACScanner] Building scanner with flex 2.6.0
cd /tmp/portage/net-analyzer/bro-2.4.1/work/bro-2.4.1/aux/binpac/src && /usr/bin/flex -o/tmp/portage/net-analyzer/bro-2.4.1/work/bro-2.4.1_build/aux/binpac/src/pac_scan.cc pac_scan.ll
[  0%] [BISON][PACParser] Building parser with bison 3.0.4
cd /tmp/portage/net-analyzer/bro-2.4.1/work/bro-2.4.1/aux/binpac/src && /usr/bin/bison --verbose --debug --defines=/tmp/portage/net-analyzer/bro-2.4.1/work/bro-2.4.1_build/aux/binpac/src/pac_parse.h -o /tmp/portage/net-analyzer/bro-2.4.1/work/bro-2.4.1_build/aux/binpac/src/pac_parse.cc pac_parse.yy
cd /tmp/portage/net-analyzer/bro-2.4.1/work/bro-2.4.1_build && /usr/bin/cmake -E cmake_depends "Unix Makefiles" /tmp/portage/net-analyzer/bro-2.4.1/work/bro-2.4.1 /tmp/portage/net-analyzer/bro-2.4.1/work/bro-2.4.1/aux/binpac/src /tmp/portage/net-analyzer/bro-2.4.1/work/bro-2.4.1_build /tmp/portage/net-analyzer/bro-2.4.1/work/bro-2.4.1_build/aux/binpac/src /tmp/portage/net-analyzer/bro-2.4.1/work/bro-2.4.1_build/aux/binpac/src/CMakeFiles/binpac.dir/DependInfo.cmake --color=
Dependee "/tmp/portage/net-analyzer/bro-2.4.1/work/bro-2.4.1_build/aux/binpac/src/CMakeFiles/binpac.dir/DependInfo.cmake" is newer than depender "/tmp/portage/net-analyzer/bro-2.4.1/work/bro-2.4.1_build/aux/binpac/src/CMakeFiles/binpac.dir/depend.internal".
Dependee "/tmp/portage/net-analyzer/bro-2.4.1/work/bro-2.4.1_build/aux/binpac/src/CMakeFiles/CMakeDirectoryInformation.cmake" is newer than depender "/tmp/portage/net-analyzer/bro-2.4.1/work/bro-2.4.1_build/aux/binpac/src/CMakeFiles/binpac.dir/depend.internal".
Scanning dependencies of target binpac
make[2]: Leaving directory '/tmp/portage/net-analyzer/bro-2.4.1/work/bro-2.4.1_build'
make -f aux/binpac/src/CMakeFiles/binpac.dir/build.make aux/binpac/src/CMakeFiles/binpac.dir/build
make[2]: Entering directory '/tmp/portage/net-analyzer/bro-2.4.1/work/bro-2.4.1_build'
[  0%] Building CXX object aux/binpac/src/CMakeFiles/binpac.dir/pac_parse.cc.o
cd /tmp/portage/net-analyzer/bro-2.4.1/work/bro-2.4.1_build/aux/binpac/src && /usr/bin/x86_64-pc-linux-gnu-g++   -I/tmp/portage/net-analyzer/bro-2.4.1/work/bro-2.4.1_build/aux/binpac -I/tmp/portage/net-analyzer/bro-2.4.1/work/bro-2.4.1/aux/binpac/src -I/tmp/portage/net-analyzer/bro-2.4.1/work/bro-2.4.1_build/aux/binpac/src   -DNDEBUG -march=broadwell -O2 -pipe -mabm  -Wall -Wno-unused   -o CMakeFiles/binpac.dir/pac_parse.cc.o -c /tmp/portage/net-analyzer/bro-2.4.1/work/bro-2.4.1_build/aux/binpac/src/pac_parse.cc
[  0%] Building CXX object aux/binpac/src/CMakeFiles/binpac.dir/pac_scan.cc.o
cd /tmp/portage/net-analyzer/bro-2.4.1/work/bro-2.4.1_build/aux/binpac/src && /usr/bin/x86_64-pc-linux-gnu-g++   -I/tmp/portage/net-analyzer/bro-2.4.1/work/bro-2.4.1_build/aux/binpac -I/tmp/portage/net-analyzer/bro-2.4.1/work/bro-2.4.1/aux/binpac/src -I/tmp/portage/net-analyzer/bro-2.4.1/work/bro-2.4.1_build/aux/binpac/src   -DNDEBUG -march=broadwell -O2 -pipe -mabm  -Wall -Wno-unused   -o CMakeFiles/binpac.dir/pac_scan.cc.o -c /tmp/portage/net-analyzer/bro-2.4.1/work/bro-2.4.1_build/aux/binpac/src/pac_scan.cc
[  0%] Building CXX object aux/binpac/src/CMakeFiles/binpac.dir/pac_action.cc.o
cd /tmp/portage/net-analyzer/bro-2.4.1/work/bro-2.4.1_build/aux/binpac/src && /usr/bin/x86_64-pc-linux-gnu-g++   -I/tmp/portage/net-analyzer/bro-2.4.1/work/bro-2.4.1_build/aux/binpac -I/tmp/portage/net-analyzer/bro-2.4.1/work/bro-2.4.1/aux/binpac/src -I/tmp/portage/net-analyzer/bro-2.4.1/work/bro-2.4.1_build/aux/binpac/src   -DNDEBUG -march=broadwell -O2 -pipe -mabm  -Wall -Wno-unused   -o CMakeFiles/binpac.dir/pac_action.cc.o -c /tmp/portage/net-analyzer/bro-2.4.1/work/bro-2.4.1/aux/binpac/src/pac_action.cc
[  0%] Building CXX object aux/binpac/src/CMakeFiles/binpac.dir/pac_analyzer.cc.o
cd /tmp/portage/net-analyzer/bro-2.4.1/work/bro-2.4.1_build/aux/binpac/src && /usr/bin/x86_64-pc-linux-gnu-g++   -I/tmp/portage/net-analyzer/bro-2.4.1/work/bro-2.4.1_build/aux/binpac -I/tmp/portage/net-analyzer/bro-2.4.1/work/bro-2.4.1/aux/binpac/src -I/tmp/portage/net-analyzer/bro-2.4.1/work/bro-2.4.1_build/aux/binpac/src   -DNDEBUG -march=broadwell -O2 -pipe -mabm  -Wall -Wno-unused   -o CMakeFiles/binpac.dir/pac_analyzer.cc.o -c /tmp/portage/net-analyzer/bro-2.4.1/work/bro-2.4.1/aux/binpac/src/pac_analyzer.cc
[  0%] Building CXX object aux/binpac/src/CMakeFiles/binpac.dir/pac_array.cc.o
cd /tmp/portage/net-analyzer/bro-2.4.1/work/bro-2.4.1_build/aux/binpac/src && /usr/bin/x86_64-pc-linux-gnu-g++   -I/tmp/portage/net-analyzer/bro-2.4.1/work/bro-2.4.1_build/aux/binpac -I/tmp/portage/net-analyzer/bro-2.4.1/work/bro-2.4.1/aux/binpac/src -I/tmp/portage/net-analyzer/bro-2.4.1/work/bro-2.4.1_build/aux/binpac/src   -DNDEBUG -march=broadwell -O2 -pipe -mabm  -Wall -Wno-unused   -o CMakeFiles/binpac.dir/pac_array.cc.o -c /tmp/portage/net-analyzer/bro-2.4.1/work/bro-2.4.1/aux/binpac/src/pac_array.cc
[  1%] Building CXX object aux/binpac/src/CMakeFiles/binpac.dir/pac_attr.cc.o
cd /tmp/portage/net-analyzer/bro-2.4.1/work/bro-2.4.1_build/aux/binpac/src && /usr/bin/x86_64-pc-linux-gnu-g++   -I/tmp/portage/net-analyzer/bro-2.4.1/work/bro-2.4.1_build/aux/binpac -I/tmp/portage/net-analyzer/bro-2.4.1/work/bro-2.4.1/aux/binpac/src -I/tmp/portage/net-analyzer/bro-2.4.1/work/bro-2.4.1_build/aux/binpac/src   -DNDEBUG -march=broadwell -O2 -pipe -mabm  -Wall -Wno-unused   -o CMakeFiles/binpac.dir/pac_attr.cc.o -c /tmp/portage/net-analyzer/bro-2.4.1/work/bro-2.4.1/aux/binpac/src/pac_attr.cc
[  1%] Building CXX object aux/binpac/src/CMakeFiles/binpac.dir/pac_btype.cc.o
cd /tmp/portage/net-analyzer/bro-2.4.1/work/bro-2.4.1_build/aux/binpac/src && /usr/bin/x86_64-pc-linux-gnu-g++   -I/tmp/portage/net-analyzer/bro-2.4.1/work/bro-2.4.1_build/aux/binpac -I/tmp/portage/net-analyzer/bro-2.4.1/work/bro-2.4.1/aux/binpac/src -I/tmp/portage/net-analyzer/bro-2.4.1/work/bro-2.4.1_build/aux/binpac/src   -DNDEBUG -march=broadwell -O2 -pipe -mabm  -Wall -Wno-unused   -o CMakeFiles/binpac.dir/pac_btype.cc.o -c /tmp/portage/net-analyzer/bro-2.4.1/work/bro-2.4.1/aux/binpac/src/pac_btype.cc
[  1%] Building CXX object aux/binpac/src/CMakeFiles/binpac.dir/pac_case.cc.o
cd /tmp/portage/net-analyzer/bro-2.4.1/work/bro-2.4.1_build/aux/binpac/src && /usr/bin/x86_64-pc-linux-gnu-g++   -I/tmp/portage/net-analyzer/bro-2.4.1/work/bro-2.4.1_build/aux/binpac -I/tmp/portage/net-analyzer/bro-2.4.1/work/bro-2.4.1/aux/binpac/src -I/tmp/portage/net-analyzer/bro-2.4.1/work/bro-2.4.1_build/aux/binpac/src   -DNDEBUG -march=broadwell -O2 -pipe -mabm  -Wall -Wno-unused   -o CMakeFiles/binpac.dir/pac_case.cc.o -c /tmp/portage/net-analyzer/bro-2.4.1/work/bro-2.4.1/aux/binpac/src/pac_case.cc
[  1%] Building CXX object aux/binpac/src/CMakeFiles/binpac.dir/pac_conn.cc.o
cd /tmp/portage/net-analyzer/bro-2.4.1/work/bro-2.4.1_build/aux/binpac/src && /usr/bin/x86_64-pc-linux-gnu-g++   -I/tmp/portage/net-analyzer/bro-2.4.1/work/bro-2.4.1_build/aux/binpac -I/tmp/portage/net-analyzer/bro-2.4.1/work/bro-2.4.1/aux/binpac/src -I/tmp/portage/net-analyzer/bro-2.4.1/work/bro-2.4.1_build/aux/binpac/src   -DNDEBUG -march=broadwell -O2 -pipe -mabm  -Wall -Wno-unused   -o CMakeFiles/binpac.dir/pac_conn.cc.o -c /tmp/portage/net-analyzer/bro-2.4.1/work/bro-2.4.1/aux/binpac/src/pac_conn.cc
[  1%] Building CXX object aux/binpac/src/CMakeFiles/binpac.dir/pac_context.cc.o
cd /tmp/portage/net-analyzer/bro-2.4.1/work/bro-2.4.1_build/aux/binpac/src && /usr/bin/x86_64-pc-linux-gnu-g++   -I/tmp/portage/net-analyzer/bro-2.4.1/work/bro-2.4.1_build/aux/binpac -I/tmp/portage/net-analyzer/bro-2.4.1/work/bro-2.4.1/aux/binpac/src -I/tmp/portage/net-analyzer/bro-2.4.1/work/bro-2.4.1_build/aux/binpac/src   -DNDEBUG -march=broadwell -O2 -pipe -mabm  -Wall -Wno-unused   -o CMakeFiles/binpac.dir/pac_context.cc.o -c /tmp/portage/net-analyzer/bro-2.4.1/work/bro-2.4.1/aux/binpac/src/pac_context.cc
[  1%] Building CXX object aux/binpac/src/CMakeFiles/binpac.dir/pac_cstr.cc.o
cd /tmp/portage/net-analyzer/bro-2.4.1/work/bro-2.4.1_build/aux/binpac/src && /usr/bin/x86_64-pc-linux-gnu-g++   -I/tmp/portage/net-analyzer/bro-2.4.1/work/bro-2.4.1_build/aux/binpac -I/tmp/portage/net-analyzer/bro-2.4.1/work/bro-2.4.1/aux/binpac/src -I/tmp/portage/net-analyzer/bro-2.4.1/work/bro-2.4.1_build/aux/binpac/src   -DNDEBUG -march=broadwell -O2 -pipe -mabm  -Wall -Wno-unused   -o CMakeFiles/binpac.dir/pac_cstr.cc.o -c /tmp/portage/net-analyzer/bro-2.4.1/work/bro-2.4.1/aux/binpac/src/pac_cstr.cc
[  1%] Building CXX object aux/binpac/src/CMakeFiles/binpac.dir/pac_datadep.cc.o
cd /tmp/portage/net-analyzer/bro-2.4.1/work/bro-2.4.1_build/aux/binpac/src && /usr/bin/x86_64-pc-linux-gnu-g++   -I/tmp/portage/net-analyzer/bro-2.4.1/work/bro-2.4.1_build/aux/binpac -I/tmp/portage/net-analyzer/bro-2.4.1/work/bro-2.4.1/aux/binpac/src -I/tmp/portage/net-analyzer/bro-2.4.1/work/bro-2.4.1_build/aux/binpac/src   -DNDEBUG -march=broadwell -O2 -pipe -mabm  -Wall -Wno-unused   -o CMakeFiles/binpac.dir/pac_datadep.cc.o -c /tmp/portage/net-analyzer/bro-2.4.1/work/bro-2.4.1/aux/binpac/src/pac_datadep.cc
[  1%] Building CXX object aux/binpac/src/CMakeFiles/binpac.dir/pac_dataptr.cc.o
cd /tmp/portage/net-analyzer/bro-2.4.1/work/bro-2.4.1_build/aux/binpac/src && /usr/bin/x86_64-pc-linux-gnu-g++   -I/tmp/portage/net-analyzer/bro-2.4.1/work/bro-2.4.1_build/aux/binpac -I/tmp/portage/net-analyzer/bro-2.4.1/work/bro-2.4.1/aux/binpac/src -I/tmp/portage/net-analyzer/bro-2.4.1/work/bro-2.4.1_build/aux/binpac/src   -DNDEBUG -march=broadwell -O2 -pipe -mabm  -Wall -Wno-unused   -o CMakeFiles/binpac.dir/pac_dataptr.cc.o -c /tmp/portage/net-analyzer/bro-2.4.1/work/bro-2.4.1/aux/binpac/src/pac_dataptr.cc
[  1%] Building CXX object aux/binpac/src/CMakeFiles/binpac.dir/pac_dataunit.cc.o
cd /tmp/portage/net-analyzer/bro-2.4.1/work/bro-2.4.1_build/aux/binpac/src && /usr/bin/x86_64-pc-linux-gnu-g++   -I/tmp/portage/net-analyzer/bro-2.4.1/work/bro-2.4.1_build/aux/binpac -I/tmp/portage/net-analyzer/bro-2.4.1/work/bro-2.4.1/aux/binpac/src -I/tmp/portage/net-analyzer/bro-2.4.1/work/bro-2.4.1_build/aux/binpac/src   -DNDEBUG -march=broadwell -O2 -pipe -mabm  -Wall -Wno-unused   -o CMakeFiles/binpac.dir/pac_dataunit.cc.o -c /tmp/portage/net-analyzer/bro-2.4.1/work/bro-2.4.1/aux/binpac/src/pac_dataunit.cc
[  1%] Building CXX object aux/binpac/src/CMakeFiles/binpac.dir/pac_decl.cc.o
cd /tmp/portage/net-analyzer/bro-2.4.1/work/bro-2.4.1_build/aux/binpac/src && /usr/bin/x86_64-pc-linux-gnu-g++   -I/tmp/portage/net-analyzer/bro-2.4.1/work/bro-2.4.1_build/aux/binpac -I/tmp/portage/net-analyzer/bro-2.4.1/work/bro-2.4.1/aux/binpac/src -I/tmp/portage/net-analyzer/bro-2.4.1/work/bro-2.4.1_build/aux/binpac/src   -DNDEBUG -march=broadwell -O2 -pipe -mabm  -Wall -Wno-unused   -o CMakeFiles/binpac.dir/pac_decl.cc.o -c /tmp/portage/net-analyzer/bro-2.4.1/work/bro-2.4.1/aux/binpac/src/pac_decl.cc
[  2%] Building CXX object aux/binpac/src/CMakeFiles/binpac.dir/pac_embedded.cc.o
cd /tmp/portage/net-analyzer/bro-2.4.1/work/bro-2.4.1_build/aux/binpac/src && /usr/bin/x86_64-pc-linux-gnu-g++   -I/tmp/portage/net-analyzer/bro-2.4.1/work/bro-2.4.1_build/aux/binpac -I/tmp/portage/net-analyzer/bro-2.4.1/work/bro-2.4.1/aux/binpac/src -I/tmp/portage/net-analyzer/bro-2.4.1/work/bro-2.4.1_build/aux/binpac/src   -DNDEBUG -march=broadwell -O2 -pipe -mabm  -Wall -Wno-unused   -o CMakeFiles/binpac.dir/pac_embedded.cc.o -c /tmp/portage/net-analyzer/bro-2.4.1/work/bro-2.4.1/aux/binpac/src/pac_embedded.cc
[  2%] Building CXX object aux/binpac/src/CMakeFiles/binpac.dir/pac_enum.cc.o
cd /tmp/portage/net-analyzer/bro-2.4.1/work/bro-2.4.1_build/aux/binpac/src && /usr/bin/x86_64-pc-linux-gnu-g++   -I/tmp/portage/net-analyzer/bro-2.4.1/work/bro-2.4.1_build/aux/binpac -I/tmp/portage/net-analyzer/bro-2.4.1/work/bro-2.4.1/aux/binpac/src -I/tmp/portage/net-analyzer/bro-2.4.1/work/bro-2.4.1_build/aux/binpac/src   -DNDEBUG -march=broadwell -O2 -pipe -mabm  -Wall -Wno-unused   -o CMakeFiles/binpac.dir/pac_enum.cc.o -c /tmp/portage/net-analyzer/bro-2.4.1/work/bro-2.4.1/aux/binpac/src/pac_enum.cc
[  2%] Building CXX object aux/binpac/src/CMakeFiles/binpac.dir/pac_expr.cc.o
cd /tmp/portage/net-analyzer/bro-2.4.1/work/bro-2.4.1_build/aux/binpac/src && /usr/bin/x86_64-pc-linux-gnu-g++   -I/tmp/portage/net-analyzer/bro-2.4.1/work/bro-2.4.1_build/aux/binpac -I/tmp/portage/net-analyzer/bro-2.4.1/work/bro-2.4.1/aux/binpac/src -I/tmp/portage/net-analyzer/bro-2.4.1/work/bro-2.4.1_build/aux/binpac/src   -DNDEBUG -march=broadwell -O2 -pipe -mabm  -Wall -Wno-unused   -o CMakeFiles/binpac.dir/pac_expr.cc.o -c /tmp/portage/net-analyzer/bro-2.4.1/work/bro-2.4.1/aux/binpac/src/pac_expr.cc
[  2%] Building CXX object aux/binpac/src/CMakeFiles/binpac.dir/pac_exttype.cc.o
cd /tmp/portage/net-analyzer/bro-2.4.1/work/bro-2.4.1_build/aux/binpac/src && /usr/bin/x86_64-pc-linux-gnu-g++   -I/tmp/portage/net-analyzer/bro-2.4.1/work/bro-2.4.1_build/aux/binpac -I/tmp/portage/net-analyzer/bro-2.4.1/work/bro-2.4.1/aux/binpac/src -I/tmp/portage/net-analyzer/bro-2.4.1/work/bro-2.4.1_build/aux/binpac/src   -DNDEBUG -march=broadwell -O2 -pipe -mabm  -Wall -Wno-unused   -o CMakeFiles/binpac.dir/pac_exttype.cc.o -c /tmp/portage/net-analyzer/bro-2.4.1/work/bro-2.4.1/aux/binpac/src/pac_exttype.cc
[  2%] Building CXX object aux/binpac/src/CMakeFiles/binpac.dir/pac_field.cc.o
cd /tmp/portage/net-analyzer/bro-2.4.1/work/bro-2.4.1_build/aux/binpac/src && /usr/bin/x86_64-pc-linux-gnu-g++   -I/tmp/portage/net-analyzer/bro-2.4.1/work/bro-2.4.1_build/aux/binpac -I/tmp/portage/net-analyzer/bro-2.4.1/work/bro-2.4.1/aux/binpac/src -I/tmp/portage/net-analyzer/bro-2.4.1/work/bro-2.4.1_build/aux/binpac/src   -DNDEBUG -march=broadwell -O2 -pipe -mabm  -Wall -Wno-unused   -o CMakeFiles/binpac.dir/pac_field.cc.o -c /tmp/portage/net-analyzer/bro-2.4.1/work/bro-2.4.1/aux/binpac/src/pac_field.cc
[  2%] Building CXX object aux/binpac/src/CMakeFiles/binpac.dir/pac_flow.cc.o
cd /tmp/portage/net-analyzer/bro-2.4.1/work/bro-2.4.1_build/aux/binpac/src && /usr/bin/x86_64-pc-linux-gnu-g++   -I/tmp/portage/net-analyzer/bro-2.4.1/work/bro-2.4.1_build/aux/binpac -I/tmp/portage/net-analyzer/bro-2.4.1/work/bro-2.4.1/aux/binpac/src -I/tmp/portage/net-analyzer/bro-2.4.1/work/bro-2.4.1_build/aux/binpac/src   -DNDEBUG -march=broadwell -O2 -pipe -mabm  -Wall -Wno-unused   -o CMakeFiles/binpac.dir/pac_flow.cc.o -c /tmp/portage/net-analyzer/bro-2.4.1/work/bro-2.4.1/aux/binpac/src/pac_flow.cc
[  2%] Building CXX object aux/binpac/src/CMakeFiles/binpac.dir/pac_func.cc.o
cd /tmp/portage/net-analyzer/bro-2.4.1/work/bro-2.4.1_build/aux/binpac/src && /usr/bin/x86_64-pc-linux-gnu-g++   -I/tmp/portage/net-analyzer/bro-2.4.1/work/bro-2.4.1_build/aux/binpac -I/tmp/portage/net-analyzer/bro-2.4.1/work/bro-2.4.1/aux/binpac/src -I/tmp/portage/net-analyzer/bro-2.4.1/work/bro-2.4.1_build/aux/binpac/src   -DNDEBUG -march=broadwell -O2 -pipe -mabm  -Wall -Wno-unused   -o CMakeFiles/binpac.dir/pac_func.cc.o -c /tmp/portage/net-analyzer/bro-2.4.1/work/bro-2.4.1/aux/binpac/src/pac_func.cc
[  2%] Building CXX object aux/binpac/src/CMakeFiles/binpac.dir/pac_id.cc.o
cd /tmp/portage/net-analyzer/bro-2.4.1/work/bro-2.4.1_build/aux/binpac/src && /usr/bin/x86_64-pc-linux-gnu-g++   -I/tmp/portage/net-analyzer/bro-2.4.1/work/bro-2.4.1_build/aux/binpac -I/tmp/portage/net-analyzer/bro-2.4.1/work/bro-2.4.1/aux/binpac/src -I/tmp/portage/net-analyzer/bro-2.4.1/work/bro-2.4.1_build/aux/binpac/src   -DNDEBUG -march=broadwell -O2 -pipe -mabm  -Wall -Wno-unused   -o CMakeFiles/binpac.dir/pac_id.cc.o -c /tmp/portage/net-analyzer/bro-2.4.1/work/bro-2.4.1/aux/binpac/src/pac_id.cc
[  2%] Building CXX object aux/binpac/src/CMakeFiles/binpac.dir/pac_inputbuf.cc.o
cd /tmp/portage/net-analyzer/bro-2.4.1/work/bro-2.4.1_build/aux/binpac/src && /usr/bin/x86_64-pc-linux-gnu-g++   -I/tmp/portage/net-analyzer/bro-2.4.1/work/bro-2.4.1_build/aux/binpac -I/tmp/portage/net-analyzer/bro-2.4.1/work/bro-2.4.1/aux/binpac/src -I/tmp/portage/net-analyzer/bro-2.4.1/work/bro-2.4.1_build/aux/binpac/src   -DNDEBUG -march=broadwell -O2 -pipe -mabm  -Wall -Wno-unused   -o CMakeFiles/binpac.dir/pac_inputbuf.cc.o -c /tmp/portage/net-analyzer/bro-2.4.1/work/bro-2.4.1/aux/binpac/src/pac_inputbuf.cc
[  2%] Building CXX object aux/binpac/src/CMakeFiles/binpac.dir/pac_let.cc.o
cd /tmp/portage/net-analyzer/bro-2.4.1/work/bro-2.4.1_build/aux/binpac/src && /usr/bin/x86_64-pc-linux-gnu-g++   -I/tmp/portage/net-analyzer/bro-2.4.1/work/bro-2.4.1_build/aux/binpac -I/tmp/portage/net-analyzer/bro-2.4.1/work/bro-2.4.1/aux/binpac/src -I/tmp/portage/net-analyzer/bro-2.4.1/work/bro-2.4.1_build/aux/binpac/src   -DNDEBUG -march=broadwell -O2 -pipe -mabm  -Wall -Wno-unused   -o CMakeFiles/binpac.dir/pac_let.cc.o -c /tmp/portage/net-analyzer/bro-2.4.1/work/bro-2.4.1/aux/binpac/src/pac_let.cc
[  3%] Building CXX object aux/binpac/src/CMakeFiles/binpac.dir/pac_param.cc.o
cd /tmp/portage/net-analyzer/bro-2.4.1/work/bro-2.4.1_build/aux/binpac/src && /usr/bin/x86_64-pc-linux-gnu-g++   -I/tmp/portage/net-analyzer/bro-2.4.1/work/bro-2.4.1_build/aux/binpac -I/tmp/portage/net-analyzer/bro-2.4.1/work/bro-2.4.1/aux/binpac/src -I/tmp/portage/net-analyzer/bro-2.4.1/work/bro-2.4.1_build/aux/binpac/src   -DNDEBUG -march=broadwell -O2 -pipe -mabm  -Wall -Wno-unused   -o CMakeFiles/binpac.dir/pac_param.cc.o -c /tmp/portage/net-analyzer/bro-2.4.1/work/bro-2.4.1/aux/binpac/src/pac_param.cc
[  3%] Building CXX object aux/binpac/src/CMakeFiles/binpac.dir/pac_paramtype.cc.o
cd /tmp/portage/net-analyzer/bro-2.4.1/work/bro-2.4.1_build/aux/binpac/src && /usr/bin/x86_64-pc-linux-gnu-g++   -I/tmp/portage/net-analyzer/bro-2.4.1/work/bro-2.4.1_build/aux/binpac -I/tmp/portage/net-analyzer/bro-2.4.1/work/bro-2.4.1/aux/binpac/src -I/tmp/portage/net-analyzer/bro-2.4.1/work/bro-2.4.1_build/aux/binpac/src   -DNDEBUG -march=broadwell -O2 -pipe -mabm  -Wall -Wno-unused   -o CMakeFiles/binpac.dir/pac_paramtype.cc.o -c /tmp/portage/net-analyzer/bro-2.4.1/work/bro-2.4.1/aux/binpac/src/pac_paramtype.cc
[  3%] Building CXX object aux/binpac/src/CMakeFiles/binpac.dir/pac_primitive.cc.o
cd /tmp/portage/net-analyzer/bro-2.4.1/work/bro-2.4.1_build/aux/binpac/src && /usr/bin/x86_64-pc-linux-gnu-g++   -I/tmp/portage/net-analyzer/bro-2.4.1/work/bro-2.4.1_build/aux/binpac -I/tmp/portage/net-analyzer/bro-2.4.1/work/bro-2.4.1/aux/binpac/src -I/tmp/portage/net-analyzer/bro-2.4.1/work/bro-2.4.1_build/aux/binpac/src   -DNDEBUG -march=broadwell -O2 -pipe -mabm  -Wall -Wno-unused   -o CMakeFiles/binpac.dir/pac_primitive.cc.o -c /tmp/portage/net-analyzer/bro-2.4.1/work/bro-2.4.1/aux/binpac/src/pac_primitive.cc
[  3%] Building CXX object aux/binpac/src/CMakeFiles/binpac.dir/pac_record.cc.o
cd /tmp/portage/net-analyzer/bro-2.4.1/work/bro-2.4.1_build/aux/binpac/src && /usr/bin/x86_64-pc-linux-gnu-g++   -I/tmp/portage/net-analyzer/bro-2.4.1/work/bro-2.4.1_build/aux/binpac -I/tmp/portage/net-analyzer/bro-2.4.1/work/bro-2.4.1/aux/binpac/src -I/tmp/portage/net-analyzer/bro-2.4.1/work/bro-2.4.1_build/aux/binpac/src   -DNDEBUG -march=broadwell -O2 -pipe -mabm  -Wall -Wno-unused   -o CMakeFiles/binpac.dir/pac_record.cc.o -c /tmp/portage/net-analyzer/bro-2.4.1/work/bro-2.4.1/aux/binpac/src/pac_record.cc
[  3%] Building CXX object aux/binpac/src/CMakeFiles/binpac.dir/pac_redef.cc.o
cd /tmp/portage/net-analyzer/bro-2.4.1/work/bro-2.4.1_build/aux/binpac/src && /usr/bin/x86_64-pc-linux-gnu-g++   -I/tmp/portage/net-analyzer/bro-2.4.1/work/bro-2.4.1_build/aux/binpac -I/tmp/portage/net-analyzer/bro-2.4.1/work/bro-2.4.1/aux/binpac/src -I/tmp/portage/net-analyzer/bro-2.4.1/work/bro-2.4.1_build/aux/binpac/src   -DNDEBUG -march=broadwell -O2 -pipe -mabm  -Wall -Wno-unused   -o CMakeFiles/binpac.dir/pac_redef.cc.o -c /tmp/portage/net-analyzer/bro-2.4.1/work/bro-2.4.1/aux/binpac/src/pac_redef.cc
[  3%] Building CXX object aux/binpac/src/CMakeFiles/binpac.dir/pac_regex.cc.o
cd /tmp/portage/net-analyzer/bro-2.4.1/work/bro-2.4.1_build/aux/binpac/src && /usr/bin/x86_64-pc-linux-gnu-g++   -I/tmp/portage/net-analyzer/bro-2.4.1/work/bro-2.4.1_build/aux/binpac -I/tmp/portage/net-analyzer/bro-2.4.1/work/bro-2.4.1/aux/binpac/src -I/tmp/portage/net-analyzer/bro-2.4.1/work/bro-2.4.1_build/aux/binpac/src   -DNDEBUG -march=broadwell -O2 -pipe -mabm  -Wall -Wno-unused   -o CMakeFiles/binpac.dir/pac_regex.cc.o -c /tmp/portage/net-analyzer/bro-2.4.1/work/bro-2.4.1/aux/binpac/src/pac_regex.cc
[  3%] Building CXX object aux/binpac/src/CMakeFiles/binpac.dir/pac_state.cc.o
cd /tmp/portage/net-analyzer/bro-2.4.1/work/bro-2.4.1_build/aux/binpac/src && /usr/bin/x86_64-pc-linux-gnu-g++   -I/tmp/portage/net-analyzer/bro-2.4.1/work/bro-2.4.1_build/aux/binpac -I/tmp/portage/net-analyzer/bro-2.4.1/work/bro-2.4.1/aux/binpac/src -I/tmp/portage/net-analyzer/bro-2.4.1/work/bro-2.4.1_build/aux/binpac/src   -DNDEBUG -march=broadwell -O2 -pipe -mabm  -Wall -Wno-unused   -o CMakeFiles/binpac.dir/pac_state.cc.o -c /tmp/portage/net-analyzer/bro-2.4.1/work/bro-2.4.1/aux/binpac/src/pac_state.cc
[  3%] Building CXX object aux/binpac/src/CMakeFiles/binpac.dir/pac_strtype.cc.o
cd /tmp/portage/net-analyzer/bro-2.4.1/work/bro-2.4.1_build/aux/binpac/src && /usr/bin/x86_64-pc-linux-gnu-g++   -I/tmp/portage/net-analyzer/bro-2.4.1/work/bro-2.4.1_build/aux/binpac -I/tmp/portage/net-analyzer/bro-2.4.1/work/bro-2.4.1/aux/binpac/src -I/tmp/portage/net-analyzer/bro-2.4.1/work/bro-2.4.1_build/aux/binpac/src   -DNDEBUG -march=broadwell -O2 -pipe -mabm  -Wall -Wno-unused   -o CMakeFiles/binpac.dir/pac_strtype.cc.o -c /tmp/portage/net-analyzer/bro-2.4.1/work/bro-2.4.1/aux/binpac/src/pac_strtype.cc
[  3%] Building CXX object aux/binpac/src/CMakeFiles/binpac.dir/pac_type.cc.o
cd /tmp/portage/net-analyzer/bro-2.4.1/work/bro-2.4.1_build/aux/binpac/src && /usr/bin/x86_64-pc-linux-gnu-g++   -I/tmp/portage/net-analyzer/bro-2.4.1/work/bro-2.4.1_build/aux/binpac -I/tmp/portage/net-analyzer/bro-2.4.1/work/bro-2.4.1/aux/binpac/src -I/tmp/portage/net-analyzer/bro-2.4.1/work/bro-2.4.1_build/aux/binpac/src   -DNDEBUG -march=broadwell -O2 -pipe -mabm  -Wall -Wno-unused   -o CMakeFiles/binpac.dir/pac_type.cc.o -c /tmp/portage/net-analyzer/bro-2.4.1/work/bro-2.4.1/aux/binpac/src/pac_type.cc
[  3%] Building CXX object aux/binpac/src/CMakeFiles/binpac.dir/pac_typedecl.cc.o
cd /tmp/portage/net-analyzer/bro-2.4.1/work/bro-2.4.1_build/aux/binpac/src && /usr/bin/x86_64-pc-linux-gnu-g++   -I/tmp/portage/net-analyzer/bro-2.4.1/work/bro-2.4.1_build/aux/binpac -I/tmp/portage/net-analyzer/bro-2.4.1/work/bro-2.4.1/aux/binpac/src -I/tmp/portage/net-analyzer/bro-2.4.1/work/bro-2.4.1_build/aux/binpac/src   -DNDEBUG -march=broadwell -O2 -pipe -mabm  -Wall -Wno-unused   -o CMakeFiles/binpac.dir/pac_typedecl.cc.o -c /tmp/portage/net-analyzer/bro-2.4.1/work/bro-2.4.1/aux/binpac/src/pac_typedecl.cc
[  4%] Building CXX object aux/binpac/src/CMakeFiles/binpac.dir/pac_withinput.cc.o
cd /tmp/portage/net-analyzer/bro-2.4.1/work/bro-2.4.1_build/aux/binpac/src && /usr/bin/x86_64-pc-linux-gnu-g++   -I/tmp/portage/net-analyzer/bro-2.4.1/work/bro-2.4.1_build/aux/binpac -I/tmp/portage/net-analyzer/bro-2.4.1/work/bro-2.4.1/aux/binpac/src -I/tmp/portage/net-analyzer/bro-2.4.1/work/bro-2.4.1_build/aux/binpac/src   -DNDEBUG -march=broadwell -O2 -pipe -mabm  -Wall -Wno-unused   -o CMakeFiles/binpac.dir/pac_withinput.cc.o -c /tmp/portage/net-analyzer/bro-2.4.1/work/bro-2.4.1/aux/binpac/src/pac_withinput.cc
[  4%] Building CXX object aux/binpac/src/CMakeFiles/binpac.dir/pac_output.cc.o
cd /tmp/portage/net-analyzer/bro-2.4.1/work/bro-2.4.1_build/aux/binpac/src && /usr/bin/x86_64-pc-linux-gnu-g++   -I/tmp/portage/net-analyzer/bro-2.4.1/work/bro-2.4.1_build/aux/binpac -I/tmp/portage/net-analyzer/bro-2.4.1/work/bro-2.4.1/aux/binpac/src -I/tmp/portage/net-analyzer/bro-2.4.1/work/bro-2.4.1_build/aux/binpac/src   -DNDEBUG -march=broadwell -O2 -pipe -mabm  -Wall -Wno-unused   -o CMakeFiles/binpac.dir/pac_output.cc.o -c /tmp/portage/net-analyzer/bro-2.4.1/work/bro-2.4.1/aux/binpac/src/pac_output.cc
[  4%] Building CXX object aux/binpac/src/CMakeFiles/binpac.dir/pac_utils.cc.o
cd /tmp/portage/net-analyzer/bro-2.4.1/work/bro-2.4.1_build/aux/binpac/src && /usr/bin/x86_64-pc-linux-gnu-g++   -I/tmp/portage/net-analyzer/bro-2.4.1/work/bro-2.4.1_build/aux/binpac -I/tmp/portage/net-analyzer/bro-2.4.1/work/bro-2.4.1/aux/binpac/src -I/tmp/portage/net-analyzer/bro-2.4.1/work/bro-2.4.1_build/aux/binpac/src   -DNDEBUG -march=broadwell -O2 -pipe -mabm  -Wall -Wno-unused   -o CMakeFiles/binpac.dir/pac_utils.cc.o -c /tmp/portage/net-analyzer/bro-2.4.1/work/bro-2.4.1/aux/binpac/src/pac_utils.cc
[  4%] Building CXX object aux/binpac/src/CMakeFiles/binpac.dir/pac_exception.cc.o
cd /tmp/portage/net-analyzer/bro-2.4.1/work/bro-2.4.1_build/aux/binpac/src && /usr/bin/x86_64-pc-linux-gnu-g++   -I/tmp/portage/net-analyzer/bro-2.4.1/work/bro-2.4.1_build/aux/binpac -I/tmp/portage/net-analyzer/bro-2.4.1/work/bro-2.4.1/aux/binpac/src -I/tmp/portage/net-analyzer/bro-2.4.1/work/bro-2.4.1_build/aux/binpac/src   -DNDEBUG -march=broadwell -O2 -pipe -mabm  -Wall -Wno-unused   -o CMakeFiles/binpac.dir/pac_exception.cc.o -c /tmp/portage/net-analyzer/bro-2.4.1/work/bro-2.4.1/aux/binpac/src/pac_exception.cc
[  4%] Building CXX object aux/binpac/src/CMakeFiles/binpac.dir/pac_main.cc.o
cd /tmp/portage/net-analyzer/bro-2.4.1/work/bro-2.4.1_build/aux/binpac/src && /usr/bin/x86_64-pc-linux-gnu-g++   -I/tmp/portage/net-analyzer/bro-2.4.1/work/bro-2.4.1_build/aux/binpac -I/tmp/portage/net-analyzer/bro-2.4.1/work/bro-2.4.1/aux/binpac/src -I/tmp/portage/net-analyzer/bro-2.4.1/work/bro-2.4.1_build/aux/binpac/src   -DNDEBUG -march=broadwell -O2 -pipe -mabm  -Wall -Wno-unused   -o CMakeFiles/binpac.dir/pac_main.cc.o -c /tmp/portage/net-analyzer/bro-2.4.1/work/bro-2.4.1/aux/binpac/src/pac_main.cc
[  4%] Linking CXX executable binpac
cd /tmp/portage/net-analyzer/bro-2.4.1/work/bro-2.4.1_build/aux/binpac/src && /usr/bin/cmake -E cmake_link_script CMakeFiles/binpac.dir/link.txt --verbose=1
/usr/bin/x86_64-pc-linux-gnu-g++   -march=broadwell -O2 -pipe -mabm  -Wall -Wno-unused   -Wl,-O1 -Wl,--as-needed CMakeFiles/binpac.dir/pac_parse.cc.o CMakeFiles/binpac.dir/pac_scan.cc.o CMakeFiles/binpac.dir/pac_action.cc.o CMakeFiles/binpac.dir/pac_analyzer.cc.o CMakeFiles/binpac.dir/pac_array.cc.o CMakeFiles/binpac.dir/pac_attr.cc.o CMakeFiles/binpac.dir/pac_btype.cc.o CMakeFiles/binpac.dir/pac_case.cc.o CMakeFiles/binpac.dir/pac_conn.cc.o CMakeFiles/binpac.dir/pac_context.cc.o CMakeFiles/binpac.dir/pac_cstr.cc.o CMakeFiles/binpac.dir/pac_datadep.cc.o CMakeFiles/binpac.dir/pac_dataptr.cc.o CMakeFiles/binpac.dir/pac_dataunit.cc.o CMakeFiles/binpac.dir/pac_decl.cc.o CMakeFiles/binpac.dir/pac_embedded.cc.o CMakeFiles/binpac.dir/pac_enum.cc.o CMakeFiles/binpac.dir/pac_expr.cc.o CMakeFiles/binpac.dir/pac_exttype.cc.o CMakeFiles/binpac.dir/pac_field.cc.o CMakeFiles/binpac.dir/pac_flow.cc.o CMakeFiles/binpac.dir/pac_func.cc.o CMakeFiles/binpac.dir/pac_id.cc.o CMakeFiles/binpac.dir/pac_inputbuf.cc.o CMakeFiles/binpac.dir/pac_let.cc.o CMakeFiles/binpac.dir/pac_param.cc.o CMakeFiles/binpac.dir/pac_paramtype.cc.o CMakeFiles/binpac.dir/pac_primitive.cc.o CMakeFiles/binpac.dir/pac_record.cc.o CMakeFiles/binpac.dir/pac_redef.cc.o CMakeFiles/binpac.dir/pac_regex.cc.o CMakeFiles/binpac.dir/pac_state.cc.o CMakeFiles/binpac.dir/pac_strtype.cc.o CMakeFiles/binpac.dir/pac_type.cc.o CMakeFiles/binpac.dir/pac_typedecl.cc.o CMakeFiles/binpac.dir/pac_withinput.cc.o CMakeFiles/binpac.dir/pac_output.cc.o CMakeFiles/binpac.dir/pac_utils.cc.o CMakeFiles/binpac.dir/pac_exception.cc.o CMakeFiles/binpac.dir/pac_main.cc.o  -o binpac -rdynamic -Wl,-rpath,:::::::: 
make[2]: Leaving directory '/tmp/portage/net-analyzer/bro-2.4.1/work/bro-2.4.1_build'
[  4%] Built target binpac
make -f aux/broker/CMakeFiles/broker.dir/build.make aux/broker/CMakeFiles/broker.dir/depend
make[2]: Entering directory '/tmp/portage/net-analyzer/bro-2.4.1/work/bro-2.4.1_build'
cd /tmp/portage/net-analyzer/bro-2.4.1/work/bro-2.4.1_build && /usr/bin/cmake -E cmake_depends "Unix Makefiles" /tmp/portage/net-analyzer/bro-2.4.1/work/bro-2.4.1 /tmp/portage/net-analyzer/bro-2.4.1/work/bro-2.4.1/aux/broker /tmp/portage/net-analyzer/bro-2.4.1/work/bro-2.4.1_build /tmp/portage/net-analyzer/bro-2.4.1/work/bro-2.4.1_build/aux/broker /tmp/portage/net-analyzer/bro-2.4.1/work/bro-2.4.1_build/aux/broker/CMakeFiles/broker.dir/DependInfo.cmake --color=
Dependee "/tmp/portage/net-analyzer/bro-2.4.1/work/bro-2.4.1_build/aux/broker/CMakeFiles/broker.dir/DependInfo.cmake" is newer than depender "/tmp/portage/net-analyzer/bro-2.4.1/work/bro-2.4.1_build/aux/broker/CMakeFiles/broker.dir/depend.internal".
Dependee "/tmp/portage/net-analyzer/bro-2.4.1/work/bro-2.4.1_build/aux/broker/CMakeFiles/CMakeDirectoryInformation.cmake" is newer than depender "/tmp/portage/net-analyzer/bro-2.4.1/work/bro-2.4.1_build/aux/broker/CMakeFiles/broker.dir/depend.internal".
Scanning dependencies of target broker
make[2]: Leaving directory '/tmp/portage/net-analyzer/bro-2.4.1/work/bro-2.4.1_build'
make -f aux/broker/CMakeFiles/broker.dir/build.make aux/broker/CMakeFiles/broker.dir/build
make[2]: Entering directory '/tmp/portage/net-analyzer/bro-2.4.1/work/bro-2.4.1_build'
[  4%] Building CXX object aux/broker/CMakeFiles/broker.dir/src/address.cc.o
cd /tmp/portage/net-analyzer/bro-2.4.1/work/bro-2.4.1_build/aux/broker && /usr/bin/x86_64-pc-linux-gnu-g++  -Dbroker_EXPORTS -I/tmp/portage/net-analyzer/bro-2.4.1/work/bro-2.4.1/aux/broker -I/tmp/portage/net-analyzer/bro-2.4.1/work/bro-2.4.1_build/aux/binpac/lib -I/tmp/portage/net-analyzer/bro-2.4.1/work/bro-2.4.1/aux/binpac/lib -I/tmp/portage/net-analyzer/bro-2.4.1/work/bro-2.4.1_build   -DNDEBUG -march=broadwell -O2 -pipe -mabm  -Wall -Wno-unused -std=c++11 -fPIC   -o CMakeFiles/broker.dir/src/address.cc.o -c /tmp/portage/net-analyzer/bro-2.4.1/work/bro-2.4.1/aux/broker/src/address.cc
[  4%] Building CXX object aux/broker/CMakeFiles/broker.dir/src/broker.cc.o
cd /tmp/portage/net-analyzer/bro-2.4.1/work/bro-2.4.1_build/aux/broker && /usr/bin/x86_64-pc-linux-gnu-g++  -Dbroker_EXPORTS -I/tmp/portage/net-analyzer/bro-2.4.1/work/bro-2.4.1/aux/broker -I/tmp/portage/net-analyzer/bro-2.4.1/work/bro-2.4.1_build/aux/binpac/lib -I/tmp/portage/net-analyzer/bro-2.4.1/work/bro-2.4.1/aux/binpac/lib -I/tmp/portage/net-analyzer/bro-2.4.1/work/bro-2.4.1_build   -DNDEBUG -march=broadwell -O2 -pipe -mabm  -Wall -Wno-unused -std=c++11 -fPIC   -o CMakeFiles/broker.dir/src/broker.cc.o -c /tmp/portage/net-analyzer/bro-2.4.1/work/bro-2.4.1/aux/broker/src/broker.cc
In file included from /tmp/portage/net-analyzer/bro-2.4.1/work/bro-2.4.1/aux/broker/src/broker.cc:9:0:
/tmp/portage/net-analyzer/bro-2.4.1/work/bro-2.4.1/aux/broker/src/store/result_type_info.hh:5:53: fatal error: caf/detail/abstract_uniform_type_info.hpp: No such file or directory
compilation terminated.
aux/broker/CMakeFiles/broker.dir/build.make:86: recipe for target 'aux/broker/CMakeFiles/broker.dir/src/broker.cc.o' failed
make[2]: *** [aux/broker/CMakeFiles/broker.dir/src/broker.cc.o] Error 1
make[2]: Leaving directory '/tmp/portage/net-analyzer/bro-2.4.1/work/bro-2.4.1_build'
CMakeFiles/Makefile2:253: recipe for target 'aux/broker/CMakeFiles/broker.dir/all' failed
make[1]: *** [aux/broker/CMakeFiles/broker.dir/all] Error 2
make[1]: Leaving directory '/tmp/portage/net-analyzer/bro-2.4.1/work/bro-2.4.1_build'
Makefile:149: recipe for target 'all' failed
make: *** [all] Error 2
 * ERROR: net-analyzer/bro-2.4.1::gentoo failed (compile phase):
 *   emake failed
 * 
 * If you need support, post the output of `emerge --info '=net-analyzer/bro-2.4.1::gentoo'`,
 * the complete build log and the output of `emerge -pqv '=net-analyzer/bro-2.4.1::gentoo'`.
 * The complete build log is located at '/var/log/portage/net-analyzer:bro-2.4.1:20160311-134801.log'.
 * For convenience, a symlink to the build log is located at '/tmp/portage/net-analyzer/bro-2.4.1/temp/build.log'.
 * The ebuild environment file is located at '/tmp/portage/net-analyzer/bro-2.4.1/temp/environment'.
 * Working directory: '/tmp/portage/net-analyzer/bro-2.4.1/work/bro-2.4.1_build'
 * S: '/tmp/portage/net-analyzer/bro-2.4.1/work/bro-2.4.1'
-------------- next part --------------
A non-text attachment was scrubbed...
Name: signature.asc
Type: application/pgp-signature
Size: 951 bytes
Desc: OpenPGP digital signature
Url : http://mailman.ICSI.Berkeley.EDU/pipermail/bro/attachments/20160311/ea1b52a0/attachment-0001.bin 


More information about the Bro mailing list